Reaction Details
TargetEpidermal growth factor receptor
LigandBDBM50326518
Substrate/Competitorn/a
Meas. Tech.ChEMBL_658253 (CHEMBL1246645)
IC50 23.02±n/a nM
Citation Pisaneschi, FNguyen, QDShamsaei, EGlaser, MRobins, EKaliszczak, MSmith, GSpivey, ACAboagye, EO Development of a new epidermal growth factor receptor positron emission tomography imaging agent based on the 3-cyanoquinoline core: synthesis and biological evaluation. Bioorg Med Chem18:6634-45 (2010) 
 
Epidermal growth factor receptor
Name:Epidermal growth factor receptor
Type:Receptor Kinase Domain
Mol. Mass.:134279.59
Organism:Homo sapiens (Human)
Description:P00533
Residue:1210
BDBM50326518
NameBDBM50326518
Synonyms:(E)-4-[(2-Fluoroethyl)methylamino]-but-2-enoic acid[4-(3-chloro-4-fluorophenylamino)-3-cyano-7-ethoxyquinoline-6-yl]amide | CHEMBL1243345
TypeSmall organic molecule
Emp. Form.C25H24ClF2N5O2
Mol. Mass.499.94
SMILESCCOc1cc2ncc(C#N)c(Nc3ccc(F)c(Cl)c3)c2cc1NC(=O)\C=C\CN(C)CCF