Reaction Details
TargetEpidermal growth factor receptor
LigandBDBM50326516
Substrate/Competitorn/a
Meas. Tech.ChEMBL_658253 (CHEMBL1246645)
IC50 21.97±n/a nM
Citation Pisaneschi, FNguyen, QDShamsaei, EGlaser, MRobins, EKaliszczak, MSmith, GSpivey, ACAboagye, EO Development of a new epidermal growth factor receptor positron emission tomography imaging agent based on the 3-cyanoquinoline core: synthesis and biological evaluation. Bioorg Med Chem18:6634-45 (2010) 
 
Epidermal growth factor receptor
Name:Epidermal growth factor receptor
Type:Receptor Kinase Domain
Mol. Mass.:134279.59
Organism:Homo sapiens (Human)
Description:P00533
Residue:1210
BDBM50326516
NameBDBM50326516
Synonyms:(E)-4-{[1-(2-Fluoroethyl)-1H-[1,2,3]triazol-4-ylmethyl]-amino}-but-2-enoic acid[4-(3-chloro-4-fluoro-phenylamino)-3-cyano-7-ethoxy-quinolin-6-yl]-amide | CHEMBL1243283
TypeSmall organic molecule
Emp. Form.C27H25ClF2N8O2
Mol. Mass.566.99
SMILESCCOc1cc2ncc(C#N)c(Nc3ccc(F)c(Cl)c3)c2cc1NC(=O)\C=C\CNCc1cn(CCF)nn1