Reaction Details
TargetBeta-2 adrenergic receptor
LigandBDBM50326551
Substrate/Competitorn/a
Meas. Tech.ChEMBL_658303 (CHEMBL1246860)
EC50 0.05±n/a nM
Citation Glossop, PALane, CAPrice, DABunnage, MELewthwaite, RAJames, KBrown, ADYeadon, MPerros-Huguet, CTrevethick, MAClarke, NPWebster, RJones, RMBurrows, JLFeeder, NTaylor, SCSpence, FJ Inhalation by design: novel ultra-long-actingß(2)-adrenoreceptor agonists for inhaled once-daily treatment of asthma and chronic obstructive pulmonary disease that utilize a sulfonamide agonist headgroup. J Med Chem53:6640-52 (2010) 
 
Beta-2 adrenergic receptor
Name:Beta-2 adrenergic receptor
Type:n/a
Mol. Mass.:46461.69
Organism:Homo sapiens (Human)
Description:P07550
Residue:413
BDBM50326551
NameBDBM50326551
Synonyms:CHEMBL1243285 | N-(2-ethoxybenzyl)-2-(3-((R)-2-((R)-2-hydroxy-2-(4-hydroxy-3-(methylsulfonamido)phenyl)ethylamino)propyl)phenyl)acetamide
TypeSmall organic molecule
Emp. Form.C29H37N3O6S
Mol. Mass.555.686
SMILESCCOc1ccccc1CNC(=O)Cc1cccc(C[C@@H](C)NC[C@H](O)c2ccc(O)c(NS(C)(=O)=O)c2)c1