Reaction Details
TargetBeta-2 adrenergic receptor
LigandBDBM50326554
Substrate/Competitorn/a
Meas. Tech.ChEMBL_658303 (CHEMBL1246860)
EC50 0.04±n/a nM
Citation Glossop, PALane, CAPrice, DABunnage, MELewthwaite, RAJames, KBrown, ADYeadon, MPerros-Huguet, CTrevethick, MAClarke, NPWebster, RJones, RMBurrows, JLFeeder, NTaylor, SCSpence, FJ Inhalation by design: novel ultra-long-actingß(2)-adrenoreceptor agonists for inhaled once-daily treatment of asthma and chronic obstructive pulmonary disease that utilize a sulfonamide agonist headgroup. J Med Chem53:6640-52 (2010) 
 
Beta-2 adrenergic receptor
Name:Beta-2 adrenergic receptor
Type:n/a
Mol. Mass.:46461.69
Organism:Homo sapiens (Human)
Description:P07550
Residue:413
BDBM50326554
NameBDBM50326554
Synonyms:2-(3-((R)-2-((R)-2-hydroxy-2-(4-hydroxy-3-(methylsulfonamido)phenyl)ethylamino)propyl)phenyl)-N-phenethylacetamide | CHEMBL1243190
TypeSmall organic molecule
Emp. Form.C28H35N3O5S
Mol. Mass.525.66
SMILESC[C@H](Cc1cccc(CC(=O)NCCc2ccccc2)c1)NC[C@H](O)c1ccc(O)c(NS(C)(=O)=O)c1