Reaction Details
TargetAdenosine receptor A3
LigandBDBM50318666
Substrate/Competitorn/a
Meas. Tech.ChEMBL_658522 (CHEMBL1247724)
IC50 8300±n/a nM
Citation Rottmann, MMcNamara, CYeung, BKLee, MCZou, BRussell, BSeitz, PPlouffe, DMDharia, NVTan, JCohen, SBSpencer, KRGonzález-Páez, GELakshminarayana, SBGoh, ASuwanarusk, RJegla, TSchmitt, EKBeck, HPBrun, RNosten, FRenia, LDartois, VKeller, THFidock, DAWinzeler, EADiagana, TT Spiroindolones, a potent compound class for the treatment of malaria. Science329:1175-80 (2010) 
 
Adenosine receptor A3
Name:Adenosine receptor A3
Type:G Protein-Coupled Receptor (GPCR)
Mol. Mass.:36197.32
Organism:Homo sapiens (Human)
Description:P0DMS8
Residue:318
BDBM50318666
NameBDBM50318666
Synonyms:(1R,3S)-5',7-Dichloro-6-fluoro-3-methyl-2,3,4,9-tetrahydrospiro-[beta-carboline-1,3'-indol]-2'(1'H)-one NITD609
TypeSmall organic molecule
Emp. Form.C19H14Cl2FN3O
Mol. Mass.390.238
SMILESC[C@H]1Cc2c([nH]c3cc(Cl)c(F)cc23)[C@@]2(N1)C(=O)Nc1ccc(Cl)cc21