Reaction Details
TargetCannabinoid receptor 1
LigandBDBM50318666
Substrate/Competitorn/a
Meas. Tech.ChEMBL_658538 (CHEMBL1247740)
IC50>10000±n/a nM
Citation Rottmann, MMcNamara, CYeung, BKLee, MCZou, BRussell, BSeitz, PPlouffe, DMDharia, NVTan, JCohen, SBSpencer, KRGonzález-Páez, GELakshminarayana, SBGoh, ASuwanarusk, RJegla, TSchmitt, EKBeck, HPBrun, RNosten, FRenia, LDartois, VKeller, THFidock, DAWinzeler, EADiagana, TT Spiroindolones, a potent compound class for the treatment of malaria. Science329:1175-80 (2010) 
 
Cannabinoid receptor 1
Name:Cannabinoid receptor 1
Type:G Protein-Coupled Receptor (GPCR)
Mol. Mass.:52868.96
Organism:Homo sapiens (Human)
Description:P21554
Residue:472
BDBM50318666
NameBDBM50318666
Synonyms:(1R,3S)-5',7-Dichloro-6-fluoro-3-methyl-2,3,4,9-tetrahydrospiro-[beta-carboline-1,3'-indol]-2'(1'H)-one NITD609
TypeSmall organic molecule
Emp. Form.C19H14Cl2FN3O
Mol. Mass.390.238
SMILESC[C@H]1Cc2c([nH]c3cc(Cl)c(F)cc23)[C@@]2(N1)C(=O)Nc1ccc(Cl)cc21