Reaction Details
TargetMHC class II antigen
LigandBDBM50326701
Substrate/Competitorn/a
Meas. Tech.ChEMBL_661466 (CHEMBL1252964)
IC50>1000±n/a nM
Citation Venkatraman, PNguyen, TTSainlos, MBilsel, OChitta, SImperiali, BStern, LJ Fluorogenic probes for monitoring peptide binding to class II MHC proteins in living cells. Nat Chem Biol3:222-8 (2007) 
 
MHC class II antigen
Name:MHC class II antigen
Type:PROTEIN
Mol. Mass.:29917.79
Organism:Homo sapiens (Human)
Description:ChEMBL_192854
Residue:266
BDBM50326701
NameBDBM50326701
Synonyms:(S)-2-(((9H-fluoren-9-yl)methoxy)carbonylamino)-3-(5-(dimethylamino)-1,3-dioxoisoindolin-2-yl)propanoic acid | CHEMBL1254609
TypeSmall organic molecule
Emp. Form.C28H25N3O6
Mol. Mass.499.5146
SMILESCN(C)c1ccc2C(=O)N(C[C@H](NC(=O)OCC3c4ccccc4-c4ccccc34)C(O)=O)C(=O)c2c1