Reaction Details
TargetMHC class II antigen
LigandBDBM50326702
Substrate/Competitorn/a
Meas. Tech.ChEMBL_661466 (CHEMBL1252964)
IC50>10000±n/a nM
Citation Venkatraman, PNguyen, TTSainlos, MBilsel, OChitta, SImperiali, BStern, LJ Fluorogenic probes for monitoring peptide binding to class II MHC proteins in living cells. Nat Chem Biol3:222-8 (2007) 
 
MHC class II antigen
Name:MHC class II antigen
Type:PROTEIN
Mol. Mass.:29917.79
Organism:Homo sapiens (Human)
Description:ChEMBL_192854
Residue:266
BDBM50326702
NameBDBM50326702
Synonyms:(2S,5S,8S,11S,14S,17S,20S,23S)-23-(2-amino-3-(5-(dimethylamino)-1,3-dioxoisoindolin-2-yl)propanamido)-8,14-bis(4-aminobutyl)-11,17-bis(carboxymethyl)-2-(3-guanidinopropyl)-20-((R)-1-hydroxyethyl)-5-(hydroxymethyl)-4,7,10,13,16,19,22-heptaoxo-3,6,9,12,15,18,21-heptaazahexacosane-1,26-dioic acid | CHEMBL1253326
TypeSmall organic molecule
Emp. Form.C51H80N16O20
Mol. Mass.1237.2761
SMILES[#6]-[#6@@H](-[#8])-[#6@H](-[#7]-[#6](=O)-[#6@H](-[#6]-[#6]-[#6](-[#8])=O)-[#7]-[#6](=O)-[#6@@H](-[#7])-[#6]-[#7]-1-[#6](=O)-c2ccc(cc2-[#6]-1=O)-[#7](-[#6])-[#6])-[#6](=O)-[#7]-[#6@@H](-[#6]-[#6](-[#8])=O)-[#6](=O)-[#7]-[#6@@H](-[#6]-[#6]-[#6]-[#6]-[#7])-[#6](=O)-[#7]-[#6@@H](-[#6]-[#6](-[#8])=O)-[#6](=O)-[#7]-[#6@@H](-[#6]-[#6]-[#6]-[#6]-[#7])-[#6](=O)-[#7]-[#6@@H](-[#6]-[#8])-[#6](=O)-[#7]-[#6@@H](-[#6]-[#6]-[#6]\[#7]=[#6](/[#7])-[#7])-[#6](-[#8])=O