Reaction Details
TargetRibosomal protein S6 kinase beta-1
LigandBDBM50326705
Substrate/Competitorn/a
Meas. Tech.ChEMBL_662543 (CHEMBL1253058)
IC50 9.1±n/a nM
Citation Okuzumi, TFiedler, DZhang, CGray, DCAizenstein, BHoffman, RShokat, KM Inhibitor hijacking of Akt activation. Nat Chem Biol5:484-93 (2009) 
 
Ribosomal protein S6 kinase beta-1
Name:Ribosomal protein S6 kinase beta-1
Type:Enzyme
Mol. Mass.:59139.89
Organism:Homo sapiens (Human)
Description:His-tagged S6K1.
Residue:525
BDBM50326705
NameBDBM50326705
Synonyms:3-bromo-4-(4-(2-methoxyphenyl)piperazin-1-yl)-1H-pyrazolo[3,4-d]pyrimidine | CHEMBL1254209
TypeSmall organic molecule
Emp. Form.C16H17BrN6O
Mol. Mass.389.25
SMILESCOc1ccccc1N1CCN(CC1)c1ncnc2n[nH]c(Br)c12