Reaction Details
TargetB1 bradykinin receptor
LigandBDBM50156455
Substrate/Competitorn/a
Meas. Tech.ChEMBL_662793 (CHEMBL1252532)
IC50 0.26±n/a nM
Citation Huang, HPlayer, MR Bradykinin B1 receptor antagonists as potential therapeutic agents for pain. J Med Chem53:5383-99 (2010) 
 
B1 bradykinin receptor
Name:B1 bradykinin receptor
Type:PROTEIN
Mol. Mass.:39519.62
Organism:Oryctolagus cuniculus
Description:ChEMBL_796432
Residue:352
BDBM50156455
NameBDBM50156455
Synonyms:(R)-N-(4-(4,5-dihydro-1H-imidazol-2-yl)phenethyl)-2-(1-(3,4-dichlorophenylsulfonyl)-3-oxo-1,2,3,4-tetrahydroquinoxalin-2-yl)acetamide CHEMBL189123
TypeSmall organic molecule
Emp. Form.C27H25Cl2N5O4S
Mol. Mass.586.49
SMILESClc1ccc(cc1Cl)S(=O)(=O)N1[C@H](CC(=O)NCCc2ccc(cc2)C2=NCCN2)C(=O)Nc2ccccc12