Reaction Details
TargetB1 bradykinin receptor
LigandBDBM50326709
Substrate/Competitorn/a
Meas. Tech.ChEMBL_662794 (CHEMBL1252533)
IC50 2.8±n/a nM
Citation Huang, HPlayer, MR Bradykinin B1 receptor antagonists as potential therapeutic agents for pain. J Med Chem53:5383-99 (2010) 
 
B1 bradykinin receptor
Name:B1 bradykinin receptor
Type:Enzyme Catalytic Domain
Mol. Mass.:38389.97
Organism:RAT
Description:B1 BRADYKININ BDKRB1 RAT::P97583
Residue:337
BDBM50326709
NameBDBM50326709
Synonyms:(R)-1-(2-oxo-5-phenethyl-1-propyl-2,3-dihydro-1H-benzo[e][1,4]diazepin-3-yl)-3-(4-(4-(pyridin-4-yl)piperazin-1-yl)phenyl)urea | CHEMBL1253497
TypeSmall organic molecule
Emp. Form.C36H39N7O2
Mol. Mass.601.7406
SMILESCCCN1c2ccccc2C(CCc2ccccc2)=N[C@@H](NC(=O)Nc2ccc(cc2)N2CCN(CC2)c2ccncc2)C1=O