Reaction Details
TargetB1 bradykinin receptor
LigandBDBM50326710
Substrate/Competitorn/a
Meas. Tech.ChEMBL_662792 (CHEMBL1252531)
Ki 0.26±n/a nM
Citation Huang, HPlayer, MR Bradykinin B1 receptor antagonists as potential therapeutic agents for pain. J Med Chem53:5383-99 (2010) 
 
B1 bradykinin receptor
Name:B1 bradykinin receptor
Type:Enzyme
Mol. Mass.:40508.87
Organism:Homo sapiens (Human)
Description:P46663
Residue:353
BDBM50326710
NameBDBM50326710
Synonyms:7-chloro-2-(3-(9-(pyridin-4-yl)-3,9-diazaspiro[5.5]undecane-3-carbonyl)phenyl)isoindolin-1-one | CHEMBL1254945
TypeSmall organic molecule
Emp. Form.C29H29ClN4O2
Mol. Mass.501.019
SMILESClc1cccc2CN(C(=O)c12)c1cccc(c1)C(=O)N1CCC2(CC1)CCN(CC2)c1ccncc1