Reaction Details
TargetThymidylate synthase
LigandBDBM50326712
Substrate/Competitorn/a
Meas. Tech.ChEMBL_661528 (CHEMBL1253092)
IC50 1.2±n/a nM
Citation Garg, DHenrich, SSalo-Ahen, OMMyllykallio, HCosti, MPWade, RC Novel approaches for targeting thymidylate synthase to overcome the resistance and toxicity of anticancer drugs. J Med Chem53:6539-49 (2010) 
 
Thymidylate synthase
Name:Thymidylate synthase
Type:Enzyme
Mol. Mass.:35718.07
Organism:Homo sapiens (Human)
Description:n/a
Residue:313
BDBM50326712
NameBDBM50326712
Synonyms:2(R)-[4(S)-carboxy-4-[4-[N-(2-hydroxymethyl-4-oxo-4,6,7,8-tetrahydro-3H-cyclopenta[g]quinazolin-6-yl)-N-(2-propynyl)amino]-benzamido]butyramido]pentanedioic acid | CHEMBL1253498
TypeSmall organic molecule
Emp. Form.C32H33N5O10
Mol. Mass.647.6319
SMILESOCc1nc2cc3CCC(N(CC#C)c4ccc(cc4)C(=O)N[C@@H](CCC(=O)N[C@H](CCC(O)=O)C(O)=O)C(O)=O)c3cc2c(=O)[nH]1