Reaction Details
TargetCytochrome c oxidase subunit 2
LigandBDBM50326828
Substrate/Competitorn/a
Meas. Tech.ChEMBL_662815 (CHEMBL1252215)
IC50 69±n/a nM
Citation Zarghi, AGhodsi, R Design, synthesis, and biological evaluation of ketoprofen analogs as potent cyclooxygenase-2 inhibitors. Bioorg Med Chem18:5855-60 (2010) 
 
Cytochrome c oxidase subunit 2
Name:Cytochrome c oxidase subunit 2
Type:PROTEIN
Mol. Mass.:25987.16
Organism:Ovis aries
Description:ChEMBL_662815
Residue:227
BDBM50326828
NameBDBM50326828
Synonyms:8-benzoyl-2-(4-(methylsulfonyl)phenyl)quinoline-4-carboxylic acid | CHEMBL1254784
TypeSmall organic molecule
Emp. Form.C24H17NO5S
Mol. Mass.431.46
SMILESCS(=O)(=O)c1ccc(cc1)-c1cc(C(O)=O)c2cccc(C(=O)c3ccccc3)c2n1