Reaction Details
TargetCytochrome c oxidase subunit 1
LigandBDBM11639
Substrate/Competitorn/a
Meas. Tech.ChEMBL_662814 (CHEMBL1252214)
IC50 24300±n/a nM
Citation Zarghi, AGhodsi, R Design, synthesis, and biological evaluation of ketoprofen analogs as potent cyclooxygenase-2 inhibitors. Bioorg Med Chem18:5855-60 (2010) 
 
Cytochrome c oxidase subunit 1
Name:Cytochrome c oxidase subunit 1
Type:PROTEIN
Mol. Mass.:57042.19
Organism:Ovis aries
Description:ChEMBL_662814
Residue:514
BDBM11639
NameBDBM11639
Synonyms:4-[5-(4-methylphenyl)-3-(trifluoromethyl)-1H-pyrazol-1-yl]benzene-1-sulfonamide CLX Celecoxib US11478464, Compound Celecoxib US8741944, Comparative Compound cid_2662
TypeSmall organic molecule
Emp. Form.C17H14F3N3O2S
Mol. Mass.381.372
SMILESCc1ccc(cc1)-c1cc(nn1-c1ccc(cc1)S(N)(=O)=O)C(F)(F)F