Reaction Details
TargetCytochrome c oxidase subunit 2
LigandBDBM11639
Substrate/Competitorn/a
Meas. Tech.ChEMBL_662815 (CHEMBL1252215)
IC50 60±n/a nM
Citation Zarghi, AGhodsi, R Design, synthesis, and biological evaluation of ketoprofen analogs as potent cyclooxygenase-2 inhibitors. Bioorg Med Chem18:5855-60 (2010) 
 
Cytochrome c oxidase subunit 2
Name:Cytochrome c oxidase subunit 2
Type:PROTEIN
Mol. Mass.:25987.16
Organism:Ovis aries
Description:ChEMBL_662815
Residue:227
BDBM11639
NameBDBM11639
Synonyms:4-[5-(4-methylphenyl)-3-(trifluoromethyl)-1H-pyrazol-1-yl]benzene-1-sulfonamide CLX Celecoxib US11478464, Compound Celecoxib US8741944, Comparative Compound cid_2662
TypeSmall organic molecule
Emp. Form.C17H14F3N3O2S
Mol. Mass.381.372
SMILESCc1ccc(cc1)-c1cc(nn1-c1ccc(cc1)S(N)(=O)=O)C(F)(F)F