Reaction Details
TargetMelanin-concentrating hormone receptor 1
LigandBDBM50326859
Substrate/Competitorn/a
Meas. Tech.ChEMBL_662927 (CHEMBL1252088)
Ki 1800±n/a nM
Citation Abbenante, GBecker, BBlanc, SClark, CCondie, GFraser, GGrathwohl, MHalliday, JHenderson, SLam, ALiu, LMann, MMuldoon, CPearson, APremraj, RRamsdale, TRossetti, TSchafer, KLe Thanh, GTometzki, GVari, FVerquin, GWaanders, JWest, MWimmer, NYau, AZuegg, JMeutermans, W Biological diversity from a structurally diverse library: systematically scanning conformational space using a pyranose scaffold. J Med Chem53:5576-86 (2010) 
 
Melanin-concentrating hormone receptor 1
Name:Melanin-concentrating hormone receptor 1
Type:G Protein-Coupled Receptor (GPCR)
Mol. Mass.:45976.27
Organism:Homo sapiens (Human)
Description:Membranes from CHO-K1 cells stably expressing human MCH1R were used in assays.
Residue:422
BDBM50326859
NameBDBM50326859
Synonyms:CHEMBL1254630 | N-((3R,4R,5S,6R)-4-(4-chlorobenzyloxy)-5-hydroxy-6-(methoxymethyl)-2-(naphthalen-2-ylmethoxy)tetrahydro-2H-pyran-3-yl)-4-(diaminomethyleneamino)butanamide
TypeSmall organic molecule
Emp. Form.C30H37ClN4O6
Mol. Mass.585.091
SMILES[#6]-[#8]-[#6]-[#6@H]-1-[#8]-[#6](-[#8]-[#6]-c2ccc3ccccc3c2)-[#6@H](-[#7]-[#6](=O)-[#6]-[#6]-[#6]\[#7]=[#6](\[#7])-[#7])-[#6@@H](-[#8]-[#6]-c2ccc(Cl)cc2)-[#6@@H]-1-[#8]