Reaction Details
TargetPotassium/sodium hyperpolarization-activated cyclic nucleotide-gated channel 1
LigandBDBM50326987
Substrate/Competitorn/a
Meas. Tech.ChEMBL_663436 (CHEMBL1250984)
EC50 31270±n/a nM
Citation Melchiorre, MDel Lungo, MGuandalini, LMartini, EDei, SManetti, DScapecchi, STeodori, ESartiani, LMugelli, ACerbai, ERomanelli, MN Design, synthesis, and preliminary biological evaluation of new isoform-selective f-current blockers. J Med Chem53:6773-7 (2010) 
 
Potassium/sodium hyperpolarization-activated cyclic nucleotide-gated channel 1
Name:Potassium/sodium hyperpolarization-activated cyclic nucleotide-gated channel 1
Type:PROTEIN
Mol. Mass.:102447.84
Organism:Mus musculus
Description:ChEMBL_663436
Residue:910
BDBM50326987
NameBDBM50326987
Synonyms:3-((Z)-4-(((S)-2-(3,4-dimethoxyphenyl)propyl)(methyl)amino)but-2-enyl)-7,8-dimethoxy-1H-benzo[d]azepin-2(3H)-one | CHEMBL1254180
TypeSmall organic molecule
Emp. Form.C28H36N2O5
Mol. Mass.480.5958
SMILESCOc1ccc(cc1OC)[C@H](C)CN(C)C\C=C/CN1C=Cc2cc(OC)c(OC)cc2CC1=O