Reaction Details
TargetPotassium/sodium hyperpolarization-activated cyclic nucleotide-gated channel 2
LigandBDBM50326992
Substrate/Competitorn/a
Meas. Tech.ChEMBL_663438 (CHEMBL1250986)
EC50 4520±n/a nM
Citation Melchiorre, MDel Lungo, MGuandalini, LMartini, EDei, SManetti, DScapecchi, STeodori, ESartiani, LMugelli, ACerbai, ERomanelli, MN Design, synthesis, and preliminary biological evaluation of new isoform-selective f-current blockers. J Med Chem53:6773-7 (2010) 
 
Potassium/sodium hyperpolarization-activated cyclic nucleotide-gated channel 2
Name:Potassium/sodium hyperpolarization-activated cyclic nucleotide-gated channel 2
Type:PROTEIN
Mol. Mass.:94741.48
Organism:Mus musculus
Description:ChEMBL_663438
Residue:863
BDBM50326992
NameBDBM50326992
Synonyms:CHEMBL471737 | ivabradine
TypeSmall organic molecule
Emp. Form.C27H36N2O5
Mol. Mass.468.5851
SMILESCOc1cc2C[C@H](CN(C)CCCN3CCc4cc(OC)c(OC)cc4CC3=O)c2cc1OC