Reaction Details
TargetPotassium/sodium hyperpolarization-activated cyclic nucleotide-gated channel 2
LigandBDBM50326988
Substrate/Competitorn/a
Meas. Tech.ChEMBL_663438 (CHEMBL1250986)
EC50 5450±n/a nM
Citation Melchiorre, MDel Lungo, MGuandalini, LMartini, EDei, SManetti, DScapecchi, STeodori, ESartiani, LMugelli, ACerbai, ERomanelli, MN Design, synthesis, and preliminary biological evaluation of new isoform-selective f-current blockers. J Med Chem53:6773-7 (2010) 
 
Potassium/sodium hyperpolarization-activated cyclic nucleotide-gated channel 2
Name:Potassium/sodium hyperpolarization-activated cyclic nucleotide-gated channel 2
Type:PROTEIN
Mol. Mass.:94741.48
Organism:Mus musculus
Description:ChEMBL_663438
Residue:863
BDBM50326988
NameBDBM50326988
Synonyms:3-(3-{[2-(3,4-Dimethoxy-phenyl)-ethyl]-methyl-amino}-propyl)-7,8-dimethoxy-1,3,4,5-tetrahydro-benzo[d]azepin-2-one Zatebradine
TypeSmall organic molecule
Emp. Form.C26H36N2O5
Mol. Mass.456.5744
SMILESCOc1ccc(CCN(C)CCCN2CCc3cc(OC)c(OC)cc3CC2=O)cc1OC