Reaction Details
TargetPotassium/sodium hyperpolarization-activated cyclic nucleotide-gated channel 2
LigandBDBM50326993
Substrate/Competitorn/a
Meas. Tech.ChEMBL_663438 (CHEMBL1250986)
EC50 24580±n/a nM
Citation Melchiorre, MDel Lungo, MGuandalini, LMartini, EDei, SManetti, DScapecchi, STeodori, ESartiani, LMugelli, ACerbai, ERomanelli, MN Design, synthesis, and preliminary biological evaluation of new isoform-selective f-current blockers. J Med Chem53:6773-7 (2010) 
 
Potassium/sodium hyperpolarization-activated cyclic nucleotide-gated channel 2
Name:Potassium/sodium hyperpolarization-activated cyclic nucleotide-gated channel 2
Type:PROTEIN
Mol. Mass.:94741.48
Organism:Mus musculus
Description:ChEMBL_663438
Residue:863
BDBM50326993
NameBDBM50326993
Synonyms:3-((Z)-4-((3,4-dimethoxyphenethyl)(methyl)amino)but-2-enyl)-7,8-dimethoxy-1H-benzo[d]azepin-2(3H)-one | CHEMBL1254085
TypeSmall organic molecule
Emp. Form.C27H34N2O5
Mol. Mass.466.5693
SMILESCOc1ccc(CCN(C)C\C=C/CN2C=Cc3cc(OC)c(OC)cc3CC2=O)cc1OC