Reaction Details
TargetLactoylglutathione lyase
LigandBDBM50326997
Substrate/Competitorn/a
Meas. Tech.ChEMBL_663474 (CHEMBL1251073)
IC50 1900±n/a nM
Citation Takasawa, RSaeki, KTao, AYoshimori, AUchiro, HFujiwara, MTanuma, S Delphinidin, a dietary anthocyanidin in berry fruits, inhibits human glyoxalase I. Bioorg Med Chem18:7029-33 (2010) 
 
Lactoylglutathione lyase
Name:Lactoylglutathione lyase
Type:Enzyme
Mol. Mass.:20772.95
Organism:Homo sapiens (Human)
Description:Q04760
Residue:184
BDBM50326997
NameBDBM50326997
Synonyms:CHEMBL590878 | Delphinidin
TypeSmall organic molecule
Emp. Form.C15H11O7
Mol. Mass.303.2431
SMILESOc1cc2oc(c(O)cc2c(=[OH+])c1)-c1cc(O)c(O)c(O)c1