Reaction Details
TargetLactoylglutathione lyase
LigandBDBM50241503
Substrate/Competitorn/a
Meas. Tech.ChEMBL_663474 (CHEMBL1251073)
IC50 11700±n/a nM
Citation Takasawa, RSaeki, KTao, AYoshimori, AUchiro, HFujiwara, MTanuma, S Delphinidin, a dietary anthocyanidin in berry fruits, inhibits human glyoxalase I. Bioorg Med Chem18:7029-33 (2010) 
 
Lactoylglutathione lyase
Name:Lactoylglutathione lyase
Type:Enzyme
Mol. Mass.:20772.95
Organism:Homo sapiens (Human)
Description:Q04760
Residue:184
BDBM50241503
NameBDBM50241503
Synonyms:2-(3,4-Dihydroxyphenyl)-3,5,7-trihydroxy-1-Benzopyrylium 3,3',4',5,7-pentahydroxyflavylium CHEMBL404515 Cyanidin | cyanidin(1+)
TypeSmall organic molecule
Emp. Form.C15H11O6
Mol. Mass.287.2437
SMILESOc1cc2oc(c(O)cc2c(=[OH+])c1)-c1ccc(O)c(O)c1