Reaction Details
TargetMitogen-activated protein kinase 14
LigandBDBM20649
Substrate/Competitorn/a
Meas. Tech.ChEMBL_663513 (CHEMBL1251166)
IC50 3.1±n/a nM
Citation Liu, CLin, JWrobleski, STLin, SHynes, JWu, HDyckman, AJLi, TWityak, JGillooly, KMPitt, SShen, DRZhang, RFMcIntyre, KWSalter-Cid, LShuster, DJZhang, HMarathe, PHDoweyko, AMSack, JSKiefer, SEKish, KFNewitt, JAMcKinnon, MDodd, JHBarrish, JCSchieven, GLLeftheris, K Discovery of 4-(5-(cyclopropylcarbamoyl)-2-methylphenylamino)-5-methyl-N-propylpyrrolo[1,2-f][1,2,4]triazine-6-carboxamide (BMS-582949), a clinical p38a MAP kinase inhibitor for the treatment of inflammatory diseases. J Med Chem53:6629-39 (2010) 
 
Mitogen-activated protein kinase 14
Name:Mitogen-activated protein kinase 14
Type:Serine/threonine-protein kinase
Mol. Mass.:41286.76
Organism:Homo sapiens (Human)
Description:Q16539
Residue:360
BDBM20649
NameBDBM20649
Synonyms:N-ethyl-4-{[5-(methoxycarbamoyl)-2-methylphenyl]amino}-5-methylpyrrolo[1,2-a][1,2,4]triazine-6-carboxamide | pyrrolo[2,1-f][1,2,4]triazine analogue, 11b
TypeSmall organic molecule
Emp. Form.C19H22N6O3
Mol. Mass.382.4164
SMILESCCNC(=O)c1cn2ncnc(Nc3cc(ccc3C)C(=O)NOC)c2c1C