Reaction Details
Target1,3-beta-D-glucan synthase catalytic subunit
LigandBDBM50327036
Substrate/Competitorn/a
Meas. Tech.ChEMBL_663643 (CHEMBL1251396)
IC50>90000±n/a nM
Citation Ma, CMAbe, TKomiyama, TWang, WHattori, MDaneshtalab, M Synthesis, anti-fungal and 1,3-ß-D-glucan synthase inhibitory activities of caffeic and quinic acid derivatives. Bioorg Med Chem18:7009-14 (2010) 
 
1,3-beta-D-glucan synthase catalytic subunit
Name:1,3-beta-D-glucan synthase catalytic subunit
Type:PROTEIN
Mol. Mass.:80469.77
Organism:Candida albicans
Description:ChEMBL_663643
Residue:690
BDBM50327036
NameBDBM50327036
Synonyms:(1R,3S,4S,5S)-3-[(E)-3-(3,4-Dihydroxy-phenyl)-acryloyloxy]-1,4,5-trihydroxy-cyclohexanecarboxylic acid (1S,3R,4R,5R,E)-3-(3-(3,4-dihydroxyphenyl)acryloyloxy)-1,4,5-trihydroxycyclohexanecarboxylic acid 3-[3-(3,4-Dihydroxy-phenyl)-acryloyloxy]-1,4,5-trihydroxy-cyclohexanecarboxylic acid 5-caffeoyl quinic acid Caffeoylquinic acid Chlorogenicacid US11866416, Example 10 | chlorogenic acid
TypeSmall organic molecule
Emp. Form.C16H18O9
Mol. Mass.354.3087
SMILESO[C@@H]1C[C@](O)(C[C@@H](OC(=O)\C=C\c2ccc(O)c(O)c2)[C@@H]1O)C(O)=O