Reaction Details
TargetAndrogen receptor
LigandBDBM18692
Substrate/Competitorn/a
Meas. Tech.ChEMBL_663713 (CHEMBL1250613)
IC50 300±n/a nM
Citation Fousteris, MASchubert, URoell, DRoediger, JBailis, NNikolaropoulos, SSBaniahmad, AGiannis, A 20-Aminosteroids as a novel class of selective and complete androgen receptor antagonists and inhibitors of prostate cancer cell growth. Bioorg Med Chem18:6960-9 (2010) 
 
Androgen receptor
Name:Androgen receptor
Type:Receptor
Mol. Mass.:99185.27
Organism:Homo sapiens (Human)
Description:CHO cells were stably transfected with human AR gene.
Residue:920
BDBM18692
NameBDBM18692
Synonyms:(2S)-N-[4-cyano-3-(trifluoromethyl)phenyl]-3-[(4-fluorobenzene)sulfonyl]-2-hydroxy-2-methylpropanamide CHEMBL124881
TypeSmall organic molecule
Emp. Form.C18H14F4N2O4S
Mol. Mass.430.373
SMILESC[C@@](O)(CS(=O)(=O)c1ccc(F)cc1)C(=O)Nc1ccc(C#N)c(c1)C(F)(F)F