Reaction Details
TargetAurora kinase A
LigandBDBM50327046
Substrate/Competitorn/a
Meas. Tech.ChEMBL_663760 (CHEMBL1250660)
IC50 1050±n/a nM
Citation Oguro, YMiyamoto, NOkada, KTakagi, TIwata, HAwazu, YMiki, HHori, AKamiyama, KImamura, S Design, synthesis, and evaluation of 5-methyl-4-phenoxy-5H-pyrrolo[3,2-d]pyrimidine derivatives: novel VEGFR2 kinase inhibitors binding to inactive kinase conformation. Bioorg Med Chem18:7260-73 (2010) 
 
Aurora kinase A
Name:Aurora kinase A
Type:Serine/threonine-protein kinase
Mol. Mass.:45830.98
Organism:Homo sapiens (Human)
Description:O14965
Residue:403
BDBM50327046
NameBDBM50327046
Synonyms:1-(2-fluoro-4-(5-methyl-5H-pyrrolo[3,2-d]pyrimidin-4-yloxy)phenyl)-3-(3-(trifluoromethyl)phenyl)urea CHEMBL1254007 | D3RKN_16
TypeSmall organic molecule
Emp. Form.C21H15F4N5O2
Mol. Mass.445.3697
SMILESCn1ccc2ncnc(Oc3ccc(NC(=O)Nc4cccc(c4)C(F)(F)F)c(F)c3)c12