Reaction Details
TargetVascular endothelial growth factor receptor 2
LigandBDBM50327061
Substrate/Competitorn/a
Meas. Tech.ChEMBL_663741 (CHEMBL1250641)
IC50 32±n/a nM
Citation Oguro, YMiyamoto, NOkada, KTakagi, TIwata, HAwazu, YMiki, HHori, AKamiyama, KImamura, S Design, synthesis, and evaluation of 5-methyl-4-phenoxy-5H-pyrrolo[3,2-d]pyrimidine derivatives: novel VEGFR2 kinase inhibitors binding to inactive kinase conformation. Bioorg Med Chem18:7260-73 (2010) 
 
Vascular endothelial growth factor receptor 2
Name:Vascular endothelial growth factor receptor 2
Type:Receptor Tyrosine Kinase
Mol. Mass.:151510.97
Organism:Homo sapiens (Human)
Description:P35968
Residue:1356
BDBM50327061
NameBDBM50327061
Synonyms:1-(4-Chlorophenyl)-3-{4-[(5-methyl-5H-pyrrolo[3,2-d]pyrimidin-4-yl)oxy]phenyl}urea | CHEMBL1254752
TypeSmall organic molecule
Emp. Form.C20H16ClN5O2
Mol. Mass.393.826
SMILESCn1ccc2ncnc(Oc3ccc(NC(=O)Nc4ccc(Cl)cc4)cc3)c12