Reaction Details
TargetVascular endothelial growth factor receptor 2
LigandBDBM50327069
Substrate/Competitorn/a
Meas. Tech.ChEMBL_663741 (CHEMBL1250641)
IC50 7.1±n/a nM
Citation Oguro, YMiyamoto, NOkada, KTakagi, TIwata, HAwazu, YMiki, HHori, AKamiyama, KImamura, S Design, synthesis, and evaluation of 5-methyl-4-phenoxy-5H-pyrrolo[3,2-d]pyrimidine derivatives: novel VEGFR2 kinase inhibitors binding to inactive kinase conformation. Bioorg Med Chem18:7260-73 (2010) 
 
Vascular endothelial growth factor receptor 2
Name:Vascular endothelial growth factor receptor 2
Type:Receptor Tyrosine Kinase
Mol. Mass.:151510.97
Organism:Homo sapiens (Human)
Description:P35968
Residue:1356
BDBM50327069
NameBDBM50327069
Synonyms:1-[4-(5,6-Dihydro-4H-pyrrolo[3,2,1-de]pteridin-4-yl)-phenyl]-3-[3-(trifluoromethyl)phenyl]urea | CHEMBL1254096
TypeSmall organic molecule
Emp. Form.C22H17F3N6O
Mol. Mass.438.4052
SMILESFC(F)(F)c1cccc(NC(=O)Nc2ccc(cc2)N2CCn3ccc4ncnc2c34)c1