Reaction Details
TargetVascular endothelial growth factor receptor 2
LigandBDBM50327072
Substrate/Competitorn/a
Meas. Tech.ChEMBL_663741 (CHEMBL1250641)
IC50 14±n/a nM
Citation Oguro, YMiyamoto, NOkada, KTakagi, TIwata, HAwazu, YMiki, HHori, AKamiyama, KImamura, S Design, synthesis, and evaluation of 5-methyl-4-phenoxy-5H-pyrrolo[3,2-d]pyrimidine derivatives: novel VEGFR2 kinase inhibitors binding to inactive kinase conformation. Bioorg Med Chem18:7260-73 (2010) 
 
Vascular endothelial growth factor receptor 2
Name:Vascular endothelial growth factor receptor 2
Type:Receptor Tyrosine Kinase
Mol. Mass.:151510.97
Organism:Homo sapiens (Human)
Description:P35968
Residue:1356
BDBM50327072
NameBDBM50327072
Synonyms:1-{2-Methoxy-4-[(5-methyl-5H-pyrrolo[3,2-d]pyrimidin-4-yl)oxy]phenyl}-3-[3-(trifluoromethyl)phenyl]urea | CHEMBL1254276
TypeSmall organic molecule
Emp. Form.C22H18F3N5O3
Mol. Mass.457.4052
SMILESCOc1cc(Oc2ncnc3ccn(C)c23)ccc1NC(=O)Nc1cccc(c1)C(F)(F)F