Reaction Details
TargetMyelin-associated glycoprotein
LigandBDBM50327099
Substrate/Competitorn/a
Meas. Tech.ChEMBL_663794 (CHEMBL1250694)
Kd 500±n/a nM
Citation Schwardt, OKoliwer-Brandl, HZimmerli, RMesch, SRossato, GSpreafico, MVedani, AKelm, SErnst, B Design, synthesis, biological evaluation, and modeling of a non-carbohydrate antagonist of the myelin-associated glycoprotein. Bioorg Med Chem18:7239-51 (2010) 
 
Myelin-associated glycoprotein
Name:Myelin-associated glycoprotein
Type:PROTEIN
Mol. Mass.:69368.91
Organism:Mus musculus
Description:ChEMBL_663794
Residue:627
BDBM50327099
NameBDBM50327099
Synonyms:CHEMBL1253679 | sodium2R,4S,5R,6R)-6-((1R,2R)-3-(4-chlorobenzamido)-1,2-dihydroxypropyl)-2-(2,3-difluorobenzyloxy)-5-(2-fluoroacetamido)-4-hydroxytetrahydro-2H-pyran-2-carboxylate
TypeSmall organic molecule
Emp. Form.C25H25ClF3N2O9
Mol. Mass.589.923
SMILESO[C@H](CNC(=O)c1ccc(Cl)cc1)[C@@H](O)[C@@H]1O[C@@](C[C@H](O)[C@H]1NC(=O)CF)(OCc1cccc(F)c1F)C([O-])=O