Reaction Details
TargetDelta-type opioid receptor
LigandBDBM50327245
Substrate/Competitorn/a
Meas. Tech.ChEMBL_664323 (CHEMBL1259358)
IC50 22049±n/a nM
Citation Brugel, TASmith, RWBalestra, MBecker, CDaniels, THoerter, TNKoether, GMThroner, SRPanko, LMFolmer, JJCacciola, JHunter, AMLiu, REdwards, PDBrown, DGGordon, JLedonne, NCPietras, MSchroeder, PSygowski, LAHirata, LTZacco, APeters, MF Discovery of 8-azabicyclo[3.2.1]octan-3-yloxy-benzamides as selective antagonists of the kappa opioid receptor. Part 1. Bioorg Med Chem Lett20:5847-52 (2010) 
 
Delta-type opioid receptor
Name:Delta-type opioid receptor
Type:G Protein-Coupled Receptor (GPCR)
Mol. Mass.:40382.98
Organism:Homo sapiens (Human)
Description:Competition binding assays were carried out using membrane preparations from transfected HN9.10 cells that constitutively expressed the delta opioid receptor.
Residue:372
BDBM50327245
NameBDBM50327245
Synonyms:CHEMBL1255595 | endo-3-(8-((5-methylfuran-2-yl)methyl)-8-azabicyclo[3.2.1]octan-3-yloxy)benzamide
TypeSmall organic molecule
Emp. Form.C20H24N2O3
Mol. Mass.340.4162
SMILESCc1ccc(CN2[C@H]3CC[C@@H]2C[C@H](C3)Oc2cccc(c2)C(N)=O)o1