Reaction Details
TargetMu-type opioid receptor
LigandBDBM50327252
Substrate/Competitorn/a
Meas. Tech.ChEMBL_664322 (CHEMBL1259357)
IC50 2894±n/a nM
Citation Brugel, TASmith, RWBalestra, MBecker, CDaniels, THoerter, TNKoether, GMThroner, SRPanko, LMFolmer, JJCacciola, JHunter, AMLiu, REdwards, PDBrown, DGGordon, JLedonne, NCPietras, MSchroeder, PSygowski, LAHirata, LTZacco, APeters, MF Discovery of 8-azabicyclo[3.2.1]octan-3-yloxy-benzamides as selective antagonists of the kappa opioid receptor. Part 1. Bioorg Med Chem Lett20:5847-52 (2010) 
 
Mu-type opioid receptor
Name:Mu-type opioid receptor
Type:G Protein-Coupled Receptor (GPCR)
Mol. Mass.:44789.51
Organism:Homo sapiens (Human)
Description:P35372
Residue:400
BDBM50327252
NameBDBM50327252
Synonyms:CHEMBL1258048 | endo-3-(8-(pyridin-3-ylmethyl)-8-azabicyclo[3.2.1]octan-3-yloxy)benzamide
TypeSmall organic molecule
Emp. Form.C20H23N3O2
Mol. Mass.337.4155
SMILESNC(=O)c1cccc(O[C@H]2C[C@@H]3CC[C@H](C2)N3Cc2cccnc2)c1