Reaction Details
TargetPotassium voltage-gated channel subfamily H member 2
LigandBDBM50327266
Substrate/Competitorn/a
Meas. Tech.ChEMBL_664324 (CHEMBL1259359)
IC50 1.6±n/a nM
Citation Brugel, TASmith, RWBalestra, MBecker, CDaniels, THoerter, TNKoether, GMThroner, SRPanko, LMFolmer, JJCacciola, JHunter, AMLiu, REdwards, PDBrown, DGGordon, JLedonne, NCPietras, MSchroeder, PSygowski, LAHirata, LTZacco, APeters, MF Discovery of 8-azabicyclo[3.2.1]octan-3-yloxy-benzamides as selective antagonists of the kappa opioid receptor. Part 1. Bioorg Med Chem Lett20:5847-52 (2010) 
 
Potassium voltage-gated channel subfamily H member 2
Name:Potassium voltage-gated channel subfamily H member 2
Type:Multi-pass membrane protein
Mol. Mass.:126672.65
Organism:Homo sapiens (Human)
Description:Q12809
Residue:1159
BDBM50327266
NameBDBM50327266
Synonyms:CHEMBL1258616 | endo-3-(8-(1-(5-methylthiophen-2-yl)ethyl)-8-azabicyclo[3.2.1]octan-3-yloxy)benzamide
TypeSmall organic molecule
Emp. Form.C21H26N2O2S
Mol. Mass.370.508
SMILESCC(N1[C@H]2CC[C@@H]1C[C@H](C2)Oc1cccc(c1)C(N)=O)c1ccc(C)s1