Reaction Details
TargetMu-type opioid receptor
LigandBDBM50327265
Substrate/Competitorn/a
Meas. Tech.ChEMBL_664322 (CHEMBL1259357)
IC50 19837±n/a nM
Citation Brugel, TASmith, RWBalestra, MBecker, CDaniels, THoerter, TNKoether, GMThroner, SRPanko, LMFolmer, JJCacciola, JHunter, AMLiu, REdwards, PDBrown, DGGordon, JLedonne, NCPietras, MSchroeder, PSygowski, LAHirata, LTZacco, APeters, MF Discovery of 8-azabicyclo[3.2.1]octan-3-yloxy-benzamides as selective antagonists of the kappa opioid receptor. Part 1. Bioorg Med Chem Lett20:5847-52 (2010) 
 
Mu-type opioid receptor
Name:Mu-type opioid receptor
Type:G Protein-Coupled Receptor (GPCR)
Mol. Mass.:44789.51
Organism:Homo sapiens (Human)
Description:P35372
Residue:400
BDBM50327265
NameBDBM50327265
Synonyms:CHEMBL1258615 | endo-3-(8-(1-phenylethyl)-8-azabicyclo[3.2.1]octan-3-yloxy)benzamide
TypeSmall organic molecule
Emp. Form.C22H26N2O2
Mol. Mass.350.454
SMILESCC(N1[C@H]2CC[C@@H]1C[C@H](C2)Oc1cccc(c1)C(N)=O)c1ccccc1