Reaction Details
TargetSubstance-P receptor
LigandBDBM50327385
Substrate/Competitorn/a
Meas. Tech.ChEMBL_664411 (CHEMBL1259677)
IC50 0.21±n/a nM
Citation Morriello, GJChicchi, GJohnson, TMills, SGDemartino, JKurtz, MTsao, KLZheng, STong, XCarlson, ETownson, KWheeldon, ABoyce, SCollinson, NRupniak, NDevita, RJ Fused tricyclic pyrrolizinones that exhibit pseudo-irreversible blockade of the NK1 receptor. Bioorg Med Chem Lett20:5925-32 (2010) 
 
Substance-P receptor
Name:Substance-P receptor
Type:G Protein-Coupled Receptor (GPCR)
Mol. Mass.:46254.43
Organism:Homo sapiens (Human)
Description:P25103
Residue:407
BDBM50327385
NameBDBM50327385
Synonyms:(1S,2R,5aS,7R,8aR,8bS)-2-((R)-1-(3,5-bis(trifluoromethyl)phenyl)ethoxy)-7-ethyl-1-(4-fluorophenyl)-7-hydroxyoctahydrocyclopenta[a]pyrrolizin-5(5aH)-one | CHEMBL1256591
TypeSmall organic molecule
Emp. Form.C28H28F7NO3
Mol. Mass.559.5156
SMILESCC[C@@]1(O)C[C@@H]2[C@H](C1)C(=O)N1C[C@H](O[C@H](C)c3cc(cc(c3)C(F)(F)F)C(F)(F)F)[C@H]([C@H]21)c1ccc(F)cc1