Reaction Details
TargetSubstance-P receptor
LigandBDBM50327389
Substrate/Competitorn/a
Meas. Tech.ChEMBL_664411 (CHEMBL1259677)
IC50 0.09±n/a nM
Citation Morriello, GJChicchi, GJohnson, TMills, SGDemartino, JKurtz, MTsao, KLZheng, STong, XCarlson, ETownson, KWheeldon, ABoyce, SCollinson, NRupniak, NDevita, RJ Fused tricyclic pyrrolizinones that exhibit pseudo-irreversible blockade of the NK1 receptor. Bioorg Med Chem Lett20:5925-32 (2010) 
 
Substance-P receptor
Name:Substance-P receptor
Type:G Protein-Coupled Receptor (GPCR)
Mol. Mass.:46254.43
Organism:Homo sapiens (Human)
Description:P25103
Residue:407
BDBM50327389
NameBDBM50327389
Synonyms:(1S,2R,5aS,7S,8aR,8bS)-7-amino-2-((R)-1-(3,5-bis(trifluoromethyl)phenyl)ethoxy)-1-(4-fluorophenyl)octahydrocyclopenta[a]pyrrolizin-5(5aH)-one | CHEMBL1257235
TypeSmall organic molecule
Emp. Form.C26H25F7N2O2
Mol. Mass.530.4777
SMILESC[C@@H](O[C@H]1CN2[C@@H]([C@@H]3C[C@H](N)C[C@@H]3C2=O)[C@@H]1c1ccc(F)cc1)c1cc(cc(c1)C(F)(F)F)C(F)(F)F