Reaction Details
TargetMitogen-activated protein kinase 14
LigandBDBM50327409
Substrate/Competitorn/a
Meas. Tech.ChEMBL_664469 (CHEMBL1259851)
IC50 8±n/a nM
Citation Lin, SWrobleski, STHynes, JPitt, SZhang, RFan, YDoweyko, AMKish, KFSack, JSMalley, MFKiefer, SENewitt, JAMcKinnon, MTrzaskos, JBarrish, JCDodd, JHSchieven, GLLeftheris, K Utilization of a nitrogen-sulfur nonbonding interaction in the design of new 2-aminothiazol-5-yl-pyrimidines as p38a MAP kinase inhibitors. Bioorg Med Chem Lett20:5864-8 (2010) 
 
Mitogen-activated protein kinase 14
Name:Mitogen-activated protein kinase 14
Type:Serine/threonine-protein kinase
Mol. Mass.:41286.76
Organism:Homo sapiens (Human)
Description:Q16539
Residue:360
BDBM50327409
NameBDBM50327409
Synonyms:(S)-N-sec-butyl-5-(6-(2-chlorophenyl)-2-(pyridin-2-yl)pyrimidin-4-yl)thiazol-2-amine | CHEMBL1258741
TypeSmall organic molecule
Emp. Form.C22H20ClN5S
Mol. Mass.421.946
SMILESCC[C@H](C)Nc1ncc(s1)-c1cc(nc(n1)-c1ccccn1)-c1ccccc1Cl