Reaction Details
TargetSerine/threonine-protein kinase mTOR
LigandBDBM50327426
Substrate/Competitorn/a
Meas. Tech.ChEMBL_664523 (CHEMBL1259905)
IC50 0.320000±n/a nM
Citation Venkatesan, AMChen, Zdos Santos, ODehnhardt, CSantos, EDAyral-Kaloustian, SMallon, RHollander, IFeldberg, LLucas, JYu, KChaudhary, IMansour, TS PKI-179: an orally efficacious dual phosphatidylinositol-3-kinase (PI3K)/mammalian target of rapamycin (mTOR) inhibitor. Bioorg Med Chem Lett20:5869-73 (2010) 
 
Serine/threonine-protein kinase mTOR
Name:Serine/threonine-protein kinase mTOR
Type:Rapamycin target protein
Mol. Mass.:288917.12
Organism:Homo sapiens (Human)
Description:P42345
Residue:2549
BDBM50327426
NameBDBM50327426
Synonyms:1-(4-(4-(3-oxa-8-azabicyclo[3.2.1]octan-8-yl)-6-morpholino-1,3,5-triazin-2-yl)phenyl)-3-(4-(2-hydroxyethyl)phenyl)urea | CHEMBL1258296
TypeSmall organic molecule
Emp. Form.C28H33N7O4
Mol. Mass.531.6061
SMILESOCCc1ccc(NC(=O)Nc2ccc(cc2)-c2nc(nc(n2)N2CCOCC2)N2C3CCC2COC3)cc1