Reaction Details
TargetSerine/threonine-protein kinase mTOR
LigandBDBM50327431
Substrate/Competitorn/a
Meas. Tech.ChEMBL_664523 (CHEMBL1259905)
IC50 0.500000±n/a nM
Citation Venkatesan, AMChen, Zdos Santos, ODehnhardt, CSantos, EDAyral-Kaloustian, SMallon, RHollander, IFeldberg, LLucas, JYu, KChaudhary, IMansour, TS PKI-179: an orally efficacious dual phosphatidylinositol-3-kinase (PI3K)/mammalian target of rapamycin (mTOR) inhibitor. Bioorg Med Chem Lett20:5869-73 (2010) 
 
Serine/threonine-protein kinase mTOR
Name:Serine/threonine-protein kinase mTOR
Type:Rapamycin target protein
Mol. Mass.:288917.12
Organism:Homo sapiens (Human)
Description:P42345
Residue:2549
BDBM50327431
NameBDBM50327431
Synonyms:1-(4-(4-(3-oxa-8-azabicyclo[3.2.1]octan-8-yl)-6-morpholino-1,3,5-triazin-2-yl)phenyl)-3-(pyridin-3-yl)urea | CHEMBL1258516
TypeSmall organic molecule
Emp. Form.C25H28N8O3
Mol. Mass.488.5416
SMILESO=C(Nc1ccc(cc1)-c1nc(nc(n1)N1CCOCC1)N1C2CCC1COC2)Nc1cccnc1