Reaction Details
TargetHistamine H3 receptor
LigandBDBM50269055
Substrate/Competitorn/a
Meas. Tech.ChEMBL_664613 (CHEMBL1260327)
Ki 2±n/a nM
Citation Richter, HGFreichel, CHuwyler, JNakagawa, TNettekoven, MPlancher, JMRaab, SRoche, OSchuler, FTaylor, SUllmer, CWiegand, R Discovery of potent and selective histamine H3 receptor inverse agonists based on the 3,4-dihydro-2H-pyrazino[1,2-a]indol-1-one scaffold. Bioorg Med Chem Lett20:5713-7 (2010) 
 
Histamine H3 receptor
Name:Histamine H3 receptor
Type:G Protein-Coupled Receptor (GPCR)
Mol. Mass.:48691.47
Organism:Homo sapiens (Human)
Description:Binding assays were using CHO cells stably expressing hH3R receptors.
Residue:445
BDBM50269055
NameBDBM50269055
Synonyms:(4,4-Difluoropiperidin-1-yl)[1-isopropyl-5-(1-isopropylpiperidin-4-yloxy)-1H-indol-2-yl]methanone | CHEMBL497031
TypeSmall organic molecule
Emp. Form.C25H35F2N3O2
Mol. Mass.447.5611
SMILESCC(C)N1CCC(CC1)Oc1ccc2n(C(C)C)c(cc2c1)C(=O)N1CCC(F)(F)CC1