Reaction Details
TargetHistamine H3 receptor
LigandBDBM50327473
Substrate/Competitorn/a
Meas. Tech.ChEMBL_664613 (CHEMBL1260327)
Ki 5±n/a nM
Citation Richter, HGFreichel, CHuwyler, JNakagawa, TNettekoven, MPlancher, JMRaab, SRoche, OSchuler, FTaylor, SUllmer, CWiegand, R Discovery of potent and selective histamine H3 receptor inverse agonists based on the 3,4-dihydro-2H-pyrazino[1,2-a]indol-1-one scaffold. Bioorg Med Chem Lett20:5713-7 (2010) 
 
Histamine H3 receptor
Name:Histamine H3 receptor
Type:G Protein-Coupled Receptor (GPCR)
Mol. Mass.:48691.47
Organism:Homo sapiens (Human)
Description:Binding assays were using CHO cells stably expressing hH3R receptors.
Residue:445
BDBM50327473
NameBDBM50327473
Synonyms:8-(1-isopropylpiperidin-4-yloxy)-2-(pyridin-4-ylmethyl)-3,4-dihydropyrazino[1,2-a]indol-1(2H)-one | CHEMBL1257487
TypeSmall organic molecule
Emp. Form.C25H30N4O2
Mol. Mass.418.5313
SMILESCC(C)N1CCC(CC1)Oc1ccc2n3CCN(Cc4ccncc4)C(=O)c3cc2c1