Reaction Details
TargetCytochrome P450 2D6
LigandBDBM50327482
Substrate/Competitorn/a
Meas. Tech.ChEMBL_664621 (CHEMBL1260335)
IC50 15000±n/a nM
Citation Richter, HGFreichel, CHuwyler, JNakagawa, TNettekoven, MPlancher, JMRaab, SRoche, OSchuler, FTaylor, SUllmer, CWiegand, R Discovery of potent and selective histamine H3 receptor inverse agonists based on the 3,4-dihydro-2H-pyrazino[1,2-a]indol-1-one scaffold. Bioorg Med Chem Lett20:5713-7 (2010) 
 
Cytochrome P450 2D6
Name:Cytochrome P450 2D6
Type:Protein
Mol. Mass.:55774.82
Organism:Homo sapiens (Human)
Description:P10635
Residue:497
BDBM50327482
NameBDBM50327482
Synonyms:8-(1-isopropylpiperidin-4-yloxy)-2-methyl-3,4-dihydropyrazino[1,2-a]indol-1(2H)-one | CHEMBL1258873
TypeSmall organic molecule
Emp. Form.C20H27N3O2
Mol. Mass.341.4473
SMILESCC(C)N1CCC(CC1)Oc1ccc2n3CCN(C)C(=O)c3cc2c1