Reaction Details
TargetHistamine H3 receptor
LigandBDBM50327492
Substrate/Competitorn/a
Meas. Tech.ChEMBL_664613 (CHEMBL1260327)
Ki 18±n/a nM
Citation Richter, HGFreichel, CHuwyler, JNakagawa, TNettekoven, MPlancher, JMRaab, SRoche, OSchuler, FTaylor, SUllmer, CWiegand, R Discovery of potent and selective histamine H3 receptor inverse agonists based on the 3,4-dihydro-2H-pyrazino[1,2-a]indol-1-one scaffold. Bioorg Med Chem Lett20:5713-7 (2010) 
 
Histamine H3 receptor
Name:Histamine H3 receptor
Type:G Protein-Coupled Receptor (GPCR)
Mol. Mass.:48691.47
Organism:Homo sapiens (Human)
Description:Binding assays were using CHO cells stably expressing hH3R receptors.
Residue:445
BDBM50327492
NameBDBM50327492
Synonyms:8-(3-(piperidin-1-yl)propoxy)-3,4-dihydropyrazino[1,2-a]indol-1(2H)-one | CHEMBL1258193
TypeSmall organic molecule
Emp. Form.C19H25N3O2
Mol. Mass.327.4207
SMILESO=C1NCCn2c1cc1cc(OCCCN3CCCCC3)ccc21