Reaction Details
TargetHistamine H3 receptor
LigandBDBM50327493
Substrate/Competitorn/a
Meas. Tech.ChEMBL_664613 (CHEMBL1260327)
Ki 19±n/a nM
Citation Richter, HGFreichel, CHuwyler, JNakagawa, TNettekoven, MPlancher, JMRaab, SRoche, OSchuler, FTaylor, SUllmer, CWiegand, R Discovery of potent and selective histamine H3 receptor inverse agonists based on the 3,4-dihydro-2H-pyrazino[1,2-a]indol-1-one scaffold. Bioorg Med Chem Lett20:5713-7 (2010) 
 
Histamine H3 receptor
Name:Histamine H3 receptor
Type:G Protein-Coupled Receptor (GPCR)
Mol. Mass.:48691.47
Organism:Homo sapiens (Human)
Description:Binding assays were using CHO cells stably expressing hH3R receptors.
Residue:445
BDBM50327493
NameBDBM50327493
Synonyms:8-(1-isopropylpiperidin-4-yloxy)-2-(2-methoxyethyl)-3,4-dihydropyrazino[1,2-a]indol-1(2H)-one | CHEMBL1257608
TypeSmall organic molecule
Emp. Form.C22H31N3O3
Mol. Mass.385.4998
SMILESCOCCN1CCn2c(cc3cc(OC4CCN(CC4)C(C)C)ccc23)C1=O