Reaction Details
TargetG-protein coupled bile acid receptor 1
LigandBDBM50327518
Substrate/Competitorn/a
Meas. Tech.ChEMBL_664648 (CHEMBL1260362)
IC50 880±n/a nM
Citation Herbert, MRSiegel, DLStaszewski, LCayanan, CBanerjee, UDhamija, SAnderson, JFan, AWang, LRix, PShiau, AKRao, TSNoble, SAHeyman, RABischoff, EGuha, MKabakibi, APinkerton, AB Synthesis and SAR of 2-aryl-3-aminomethylquinolines as agonists of the bile acid receptor TGR5. Bioorg Med Chem Lett20:5718-21 (2010) 
 
G-protein coupled bile acid receptor 1
Name:G-protein coupled bile acid receptor 1
Type:G Protein-Coupled Receptor (GPCR)
Mol. Mass.:35260.02
Organism:Homo sapiens (Human)
Description:CHO cells transiently transfected with hTGR5.
Residue:330
BDBM50327518
NameBDBM50327518
Synonyms:1-(7-methoxy-2-(thiophen-3-yl)quinolin-3-yl)-N-(4-methylbenzyl)methanamine | CHEMBL1258195
TypeSmall organic molecule
Emp. Form.C23H22N2OS
Mol. Mass.374.499
SMILESCOc1ccc2cc(CNCc3ccc(C)cc3)c(nc2c1)-c1ccsc1