Reaction Details
TargetG-protein coupled bile acid receptor 1
LigandBDBM21679
Substrate/Competitorn/a
Meas. Tech.ChEMBL_664649 (CHEMBL1260363)
IC50 250±n/a nM
Citation Herbert, MRSiegel, DLStaszewski, LCayanan, CBanerjee, UDhamija, SAnderson, JFan, AWang, LRix, PShiau, AKRao, TSNoble, SAHeyman, RABischoff, EGuha, MKabakibi, APinkerton, AB Synthesis and SAR of 2-aryl-3-aminomethylquinolines as agonists of the bile acid receptor TGR5. Bioorg Med Chem Lett20:5718-21 (2010) 
 
G-protein coupled bile acid receptor 1
Name:G-protein coupled bile acid receptor 1
Type:PROTEIN
Mol. Mass.:35665.78
Organism:Mus musculus
Description:ChEMBL_1475560
Residue:329
BDBM21679
NameBDBM21679
Synonyms:(2S,4R)-4-[(1S,2S,5R,7S,8R,9R,10S,11S,14R,15R)-8-ethyl-5,9-dihydroxy-2,15-dimethyltetracyclo[8.7.0.0^{2,7}.0^{11,15}]heptadecan-14-yl]-2-methylpentanoic acid | 23(S)-methyl-BA derivative, 7c
TypeSteroid
Emp. Form.C27H46O4
Mol. Mass.434.6517
SMILES[H][C@@]1(CC[C@@]2([H])[C@]3([H])[C@H](O)[C@H](CC)[C@]4([H])C[C@H](O)CC[C@]4(C)[C@@]3([H])CC[C@]12C)[C@H](C)C[C@H](C)C(O)=O