Reaction Details
Target5-hydroxytryptamine receptor 1A
LigandBDBM50327603
Substrate/Competitorn/a
Meas. Tech.ChEMBL_664674 (CHEMBL1260560)
Ki 0.0447±n/a nM
Citation Favor, DAPowers, JJWhite, ADFitzgerald, LWGroppi, VSerpa, KA 6-Alkoxyisoindolin-1-one based dopamine D2 partial agonists as potential antipsychotics. Bioorg Med Chem Lett20:5666-9 (2010) 
 
5-hydroxytryptamine receptor 1A
Name:5-hydroxytryptamine receptor 1A
Type:n/a
Mol. Mass.:46122.49
Organism:Homo sapiens (Human)
Description:n/a
Residue:422
BDBM50327603
NameBDBM50327603
Synonyms:6-(3-(4-(7-fluoronaphthalen-1-yl)piperazin-1-yl)propoxy)isoindolin-1-one | CHEMBL1258648
TypeSmall organic molecule
Emp. Form.C25H26FN3O2
Mol. Mass.419.4912
SMILESFc1ccc2cccc(N3CCN(CCCOc4ccc5CNC(=O)c5c4)CC3)c2c1