Reaction Details
Target5-hydroxytryptamine receptor 1A
LigandBDBM50327582
Substrate/Competitorn/a
Meas. Tech.ChEMBL_664674 (CHEMBL1260560)
Ki 0.151±n/a nM
Citation Favor, DAPowers, JJWhite, ADFitzgerald, LWGroppi, VSerpa, KA 6-Alkoxyisoindolin-1-one based dopamine D2 partial agonists as potential antipsychotics. Bioorg Med Chem Lett20:5666-9 (2010) 
 
5-hydroxytryptamine receptor 1A
Name:5-hydroxytryptamine receptor 1A
Type:n/a
Mol. Mass.:46122.49
Organism:Homo sapiens (Human)
Description:n/a
Residue:422
BDBM50327582
NameBDBM50327582
Synonyms:6-(4-(4-(naphthalen-1-yl)piperazin-1-yl)butoxy)isoindolin-1-one | CHEMBL1258647
TypeSmall organic molecule
Emp. Form.C26H29N3O2
Mol. Mass.415.5274
SMILESO=C1NCc2ccc(OCCCCN3CCN(CC3)c3cccc4ccccc34)cc12