Reaction Details
Target5-hydroxytryptamine receptor 1A
LigandBDBM50327610
Substrate/Competitorn/a
Meas. Tech.ChEMBL_664674 (CHEMBL1260560)
Ki 0.179±n/a nM
Citation Favor, DAPowers, JJWhite, ADFitzgerald, LWGroppi, VSerpa, KA 6-Alkoxyisoindolin-1-one based dopamine D2 partial agonists as potential antipsychotics. Bioorg Med Chem Lett20:5666-9 (2010) 
 
5-hydroxytryptamine receptor 1A
Name:5-hydroxytryptamine receptor 1A
Type:n/a
Mol. Mass.:46122.49
Organism:Homo sapiens (Human)
Description:n/a
Residue:422
BDBM50327610
NameBDBM50327610
Synonyms:6-(3-(4-(6,7-difluoronaphthalen-1-yl)piperazin-1-yl)propoxy)isoindolin-1-one | CHEMBL1257145
TypeSmall organic molecule
Emp. Form.C25H25F2N3O2
Mol. Mass.437.4817
SMILESFc1cc2cccc(N3CCN(CCCOc4ccc5CNC(=O)c5c4)CC3)c2cc1F